Target
Mast/stem cell growth factor receptor Kit
Ligand
BDBM50188759
Substrate
Meas. Tech.
ChEMBL_390503 (CHEMBL869849)
IC50
19±n/a nM
Citation
 Dinges, JAshworth, KLAkritopoulou-Zanze, IAkritopolou-Zanze, IArnold, LDBaumeister, SABousquet, PFCunha, GADavidsen, SKDjuric, SWGracias, VJMichaelides, MRRafferty, PSowin, TJStewart, KDXia, ZZhang, HQ 1,4-Dihydroindeno[1,2-c]pyrazoles as novel multitargeted receptor tyrosine kinase inhibitors. Bioorg Med Chem Lett 16:4266-71 (2006)  
Target
Name:
Mast/stem cell growth factor receptor Kit
Synonyms:
CD117 antigen KIT Mast/stem cell growth factor receptor Kit (cKIT) Proto-oncogene tyrosine-protein kinase Kit Stem cell growth factor receptor Tyrosine-protein kinase Kit c-kit v-kit Hardy-Zuckerman 4 feline sarcoma viral oncogene homolog
Type:
Protein
Mol. Mass.:
109869.37
Organism:
Homo sapiens (Human)
Description:
P10721
Residue:
976
  
Inhibitor
Name:
BDBM50188759
Synonyms:
1-methyl-1-((5-(7-((4-methylpiperazin-1-yl)methyl)-1,4-dihydroindeno[1,2-c]pyrazol-3-yl)thiophen-2-yl)methyl)-3-(4-(trifluoromethoxy)phenyl)urea | CHEMBL212932
Type:
Small organic molecule
Emp. Form.:
C30H31F3N6O2S
Mol. Mass.:
596.666
SMILES:
CN(Cc1ccc(s1)-c1[nH]nc-2c1Cc1ccc(CN3CCN(C)CC3)cc-21)C(=O)Nc1ccc(OC(F)(F)F)cc1
: