Target
Vascular endothelial growth factor receptor 1
Ligand
BDBM50188760
Substrate
Meas. Tech.
ChEMBL_390502 (CHEMBL869848)
IC50
27894±n/a nM
Citation
 Dinges, JAshworth, KLAkritopoulou-Zanze, IAkritopolou-Zanze, IArnold, LDBaumeister, SABousquet, PFCunha, GADavidsen, SKDjuric, SWGracias, VJMichaelides, MRRafferty, PSowin, TJStewart, KDXia, ZZhang, HQ 1,4-Dihydroindeno[1,2-c]pyrazoles as novel multitargeted receptor tyrosine kinase inhibitors. Bioorg Med Chem Lett 16:4266-71 (2006)  
Target
Name:
Vascular endothelial growth factor receptor 1
Synonyms:
FLT FRT Fms-like tyrosine kinase 1 Tyrosine-protein kinase FRT VEGFR-1 VGFR1_HUMAN Vascular endothelial growth factor receptor 1 (FLT1) Vascular endothelial growth factor receptor 1 and 2 (Flt-1 and KDR) Vascular permeability factor receptor vascular endothelial growth factor/vascular permeability factor receptor
Type:
Receptor Tyrosine Kinase
Mol. Mass.:
150800.23
Organism:
Homo sapiens (Human)
Description:
P17948
Residue:
1338
  
Inhibitor
Name:
BDBM50188760
Synonyms:
1,3-dimethyl-1-((5-(6-((4-methylpiperazin-1-yl)methyl)-1,4-dihydroindeno[1,2-c]pyrazol-3-yl)thiophen-2-yl)methyl)-3-m-tolylurea | CHEMBL212987
Type:
Small organic molecule
Emp. Form.:
C31H36N6OS
Mol. Mass.:
540.722
SMILES:
CN(Cc1ccc(s1)-c1[nH]nc-2c1Cc1cc(CN3CCN(C)CC3)ccc-21)C(=O)N(C)c1cccc(C)c1
: