Target
Receptor-type tyrosine-protein phosphatase gamma
Ligand
BDBM50188784
Substrate
Meas. Tech.
ChEMBL_389284 (CHEMBL868040)
IC50
93000±n/a nM
Citation
 Amarasinghe, KKEvdokimov, AGEvidokimov, AGXu, KClark, CMMaier, MBSrivastava, AColson, AOGerwe, GSStake, GEHoward, BWPokross, MEGray, JLPeters, KG Design and synthesis of potent, non-peptidic inhibitors of HPTPbeta. Bioorg Med Chem Lett 16:4252-6 (2006)  
Target
Name:
Receptor-type tyrosine-protein phosphatase gamma
Synonyms:
PTPG PTPRG_HUMAN Protein-tyrosine phosphatase gamma (PTPG) Receptor-type tyrosine-protein phosphatase gamma (PTPgamma)
Type:
Protein
Mol. Mass.:
161998.07
Organism:
Homo sapiens (Human)
Description:
P23470
Residue:
1445
  
Inhibitor
Name:
BDBM50188784
Synonyms:
CHEMBL385251 | ammonium N-{4-[3-methoxy-2-(methoxycarbonyl)-3-oxo-2-(3-phenylpropyl)propyl]phenyl}sulfamate
Type:
Small organic molecule
Emp. Form.:
C21H24NO7S
Mol. Mass.:
434.483
SMILES:
COC(=O)C(CCCc1ccccc1)(Cc1ccc(NS([O-])(=O)=O)cc1)C(=O)OC
: