Target
Neuropilin-1
Ligand
BDBM50188981
Substrate
Meas. Tech.
ChEMBL_389196 (CHEMBL867991)
IC50
22000±n/a nM
Citation
 Bedjeguelal, KBienaymé, HDumoulin, APoigny, SSchmitt, PTam, E Discovery of protein-protein binding disruptors using multi-component condensations small molecules. Bioorg Med Chem Lett 16:3998-4001 (2006)  
Target
Name:
Neuropilin-1
Synonyms:
Chain A, Crystal Structure Of The B1b2 Domains From Human Neuropilin- 1 NRP1 Neuropilin-1 | VEGF165R
Type:
PROTEIN
Mol. Mass.:
103122.09
Organism:
Homo sapiens (Human)
Description:
ChEMBL_617636
Residue:
923
  
Inhibitor
Name:
BDBM50188981
Synonyms:
5-chloro-2-(5-methylthiazol-2-yl)-3-(phenethylamino)indolizine-1-carbonitrile | CHEMBL215632
Type:
Small organic molecule
Emp. Form.:
C21H17ClN4S
Mol. Mass.:
392.904
SMILES:
Cc1cnc(s1)-c1c(NCCc2ccccc2)n2c(Cl)cccc2c1C#N
: