Target
Neuropilin-1
Ligand
BDBM50189004
Substrate
Meas. Tech.
ChEMBL_389196 (CHEMBL867991)
IC50
2000±n/a nM
Citation
 Bedjeguelal, KBienaymé, HDumoulin, APoigny, SSchmitt, PTam, E Discovery of protein-protein binding disruptors using multi-component condensations small molecules. Bioorg Med Chem Lett 16:3998-4001 (2006)  
Target
Name:
Neuropilin-1
Synonyms:
Chain A, Crystal Structure Of The B1b2 Domains From Human Neuropilin- 1 NRP1 Neuropilin-1 | VEGF165R
Type:
PROTEIN
Mol. Mass.:
103122.09
Organism:
Homo sapiens (Human)
Description:
ChEMBL_617636
Residue:
923
  
Inhibitor
Name:
BDBM50189004
Synonyms:
5-chloro-2-phenethyl-3-(phenethylamino)indolizine-1-carbonitrile | CHEMBL215821
Type:
Small organic molecule
Emp. Form.:
C25H22ClN3
Mol. Mass.:
399.915
SMILES:
Clc1cccc2c(C#N)c(CCc3ccccc3)c(NCCc3ccccc3)n12
: