Target
Melanocortin receptor 3
Ligand
BDBM50189023
Substrate
Meas. Tech.
ChEMBL_395995 (CHEMBL910340)
EC50
5.6±n/a nM
Citation
 Tian, XMishra, RKSwitzer, AGHu, XEKim, NMazur, AWEbetino, FHWos, JACrossdoersen, DPinney, BBFarmer, JASheldon, RJ Design and synthesis of potent and selective 1,3,4-trisubstituted-2-oxopiperazine based melanocortin-4 receptor agonists. Bioorg Med Chem Lett 16:4668-73 (2006)  
Target
Name:
Melanocortin receptor 3
Synonyms:
MC3-R MC3R_HUMAN Melanocortin receptor (M3 and M4)
Type:
Enzyme
Mol. Mass.:
36044.86
Organism:
Homo sapiens (Human)
Description:
P41968
Residue:
323
  
Inhibitor
Name:
BDBM50189023
Synonyms:
(S)-2-((S)-4-((R)-3-(4-fluorophenyl)-2-(piperazin-1-yl)propanoyl)-3-(3-guanidinopropyl)-2-oxopiperazin-1-yl)-N-methyl-3-(naphthalen-2-yl)propanamide | CHEMBL214410
Type:
Small organic molecule
Emp. Form.:
C35H45FN8O3
Mol. Mass.:
644.782
SMILES:
CNC(=O)[C@H](Cc1ccc2ccccc2c1)N1CCN([C@@H](CCCNC(N)=N)C1=O)C(=O)[C@@H](Cc1ccc(F)cc1)N1CCNCC1
: