Target
Kappa-type opioid receptor
Ligand
BDBM50170672
Substrate
Meas. Tech.
ChEMBL_396128 (CHEMBL910349)
Ki
7.2±n/a nM
Citation
 Béguin, CRichards, MRLi, JGWang, YXu, WLiu-Chen, LYCarlezon, WACohen, BM Synthesis and in vitro evaluation of salvinorin A analogues: effect of configuration at C(2) and substitution at C(18). Bioorg Med Chem Lett 16:4679-85 (2006)  
Target
Name:
Kappa-type opioid receptor
Synonyms:
K-OR-1 Kappa-opioid receptor (KOR) Kappa-type opioid receptor (KOR) OPIATE Kappa OPRK1 kappa opioid receptor (KOR)
Type:
G Protein-Coupled Receptor (GPCR)
Mol. Mass.:
42648.76
Organism:
Homo sapiens (Human)
Description:
P41145
Residue:
380
  
Inhibitor
Name:
BDBM50170672
Synonyms:
(2S,4aR,6aR,7R,9S,10aS,10bR)-methyl 2-(furan-3-yl)-6a,10b-dimethyl-4,10-dioxo-9-(propionyloxy)-dodecahydro-1H-benzo[f]isochromene-7-carboxylate CHEMBL370272
Type:
Small organic molecule
Emp. Form.:
C24H30O8
Mol. Mass.:
446.4902
SMILES:
CCC(=O)O[C@H]1C[C@@H](C(=O)OC)[C@]2(C)CC[C@H]3C(=O)O[C@@H](C[C@]3(C)[C@H]2C1=O)c1ccoc1
: