Target
Glutamate receptor ionotropic, NMDA 2B
Ligand
BDBM50189384
Substrate
Meas. Tech.
ChEMBL_395467 (CHEMBL909221)
IC50
8.4±n/a nM
Citation
 Borza, IKolok, SGere, ANagy, JFodor, LGalgóczy, KFetter, JBertha, FAgai, BHorváth, CFarkas, SDomány, G Benzimidazole-2-carboxamides as novel NR2B selective NMDA receptor antagonists. Bioorg Med Chem Lett 16:4638-40 (2006)  
Target
Name:
Glutamate receptor ionotropic, NMDA 2B
Synonyms:
GluN2B Grin2b NMDA receptor subunit N2B (GluN2B) NMDE2_RAT | NR2B
Type:
Protein
Mol. Mass.:
166077.66
Organism:
Rattus norvegicus (Rat)
Description:
Q00960
Residue:
1482
  
Inhibitor
Name:
BDBM50189384
Synonyms:
(5-hydroxy-1H-benzoimidazol-2-yl)-[4-(2-methyl-benzyl)-piperidin-1-yl]-methanone | CHEMBL214632
Type:
Small organic molecule
Emp. Form.:
C21H23N3O2
Mol. Mass.:
349.4262
SMILES:
Cc1ccccc1CC1CCN(CC1)C(=O)c1nc2ccc(O)cc2[nH]1
: