Target
Glutamate receptor ionotropic, NMDA 2B
Ligand
BDBM50189390
Substrate
Meas. Tech.
ChEMBL_395467 (CHEMBL909221)
IC50
143±n/a nM
Citation
 Borza, IKolok, SGere, ANagy, JFodor, LGalgóczy, KFetter, JBertha, FAgai, BHorváth, CFarkas, SDomány, G Benzimidazole-2-carboxamides as novel NR2B selective NMDA receptor antagonists. Bioorg Med Chem Lett 16:4638-40 (2006)  
Target
Name:
Glutamate receptor ionotropic, NMDA 2B
Synonyms:
GluN2B Grin2b NMDA receptor subunit N2B (GluN2B) NMDE2_RAT | NR2B
Type:
Protein
Mol. Mass.:
166077.66
Organism:
Rattus norvegicus (Rat)
Description:
Q00960
Residue:
1482
  
Inhibitor
Name:
BDBM50189390
Synonyms:
(5-amino-1H-benzo[d]imidazol-2-yl)(4-benzylpiperidin-1-yl)methanone | CHEMBL215371
Type:
Small organic molecule
Emp. Form.:
C20H22N4O
Mol. Mass.:
334.4149
SMILES:
Nc1ccc2nc([nH]c2c1)C(=O)N1CCC(Cc2ccccc2)CC1
: