Target
Sodium-dependent serotonin transporter
Ligand
BDBM50189574
Substrate
Meas. Tech.
ChEMBL_395401 (CHEMBL908066)
Ki
0.82±n/a nM
Citation
 Zeng, FJarkas, NOwens, MJKilts, CDNemeroff, CBGoodman, MM Synthesis and monoamine transporter affinity of front bridged tricyclic 3beta-(4'-halo or 4'-methyl)phenyltropanes bearing methylene or carbomethoxymethylene on the bridge to the 2beta-position. Bioorg Med Chem Lett 16:4661-3 (2006)  
Target
Name:
Sodium-dependent serotonin transporter
Synonyms:
5-HT Transporter 5HTT SC6A4_HUMAN SLC6A4 Serotonin transporter (5HTT) Sodium-dependent serotonin transporter (SERT) | Solute carrier family 6 member 4
Type:
Multi-pass membrane protein
Mol. Mass.:
70322.51
Organism:
Homo sapiens (Human)
Description:
P31645
Residue:
630
  
Inhibitor
Name:
BDBM50189574
Synonyms:
3-(4-chloro-phenyl)-5-methylene-7-aza-tricyclo[5.3.0.0*4,8*]decane | CHEMBL378536
Type:
Small organic molecule
Emp. Form.:
C16H18ClN
Mol. Mass.:
259.774
SMILES:
Clc1ccc(cc1)C1CC2CCC3C1C(=C)CN23
: