Target
Epidermal growth factor receptor
Ligand
BDBM50190001
Substrate
Meas. Tech.
ChEMBL_401654 (CHEMBL856356)
IC50
1±n/a nM
Citation
 Ballard, PBradbury, RHHarris, CSHennequin, LFHickinson, MKettle, JGKendrew, JKlinowska, TOgilvie, DJPearson, SEWilliams, EJWilson, I Inhibitors of epidermal growth factor receptor tyrosine kinase: optimisation of potency and in vivo pharmacokinetics. Bioorg Med Chem Lett 16:4908-12 (2006)  
Target
Name:
Epidermal growth factor receptor
Synonyms:
EGF Receptor Substrate EGFR_HUMAN ERBB1 Epidermal Growth Factor Receptor erbB-1 Epidermal growth factor receptor (EGFR) HER1 Proto-oncogene c-ErbB-1 Tyrosine-Protein Kinase ErbB-1
Type:
Receptor Kinase Domain
Mol. Mass.:
134279.59
Organism:
Homo sapiens (Human)
Description:
P00533
Residue:
1210
  
Inhibitor
Name:
BDBM50190001
Synonyms:
CHEMBL213007 | N-(5-chloro-2-fluorophenyl)-7-methoxy-6-(1-(methylsulfonyl)piperidin-4-yloxy)quinazolin-4-amine
Type:
Small organic molecule
Emp. Form.:
C21H22ClFN4O4S
Mol. Mass.:
480.94
SMILES:
COc1cc2ncnc(Nc3cc(Cl)ccc3F)c2cc1OC1CCN(CC1)S(C)(=O)=O
: