Target
Carbonic anhydrase 9
Ligand
BDBM50190241
Substrate
Meas. Tech.
ChEMBL_400481 (CHEMBL912681)
Ki
113±n/a nM
Citation
 Slawinski, FSlawinski, JKornicka, ABrzozowski, ZPomarnacka, EInnocenti, ASlawinski, ASlawinski, CT Carbonic anhydrase inhibitors. Inhibition of the cytosolic human isozymes I and II, and the transmembrane, tumor-associated isozymes IX and XII with substituted aromatic sulfonamides activatable in hypoxic tumors. Bioorg Med Chem Lett 16:4846-51 (2006)  
Target
Name:
Carbonic anhydrase 9
Synonyms:
CA-IX CAH9_HUMAN Carbonic anhydrase 9 (CA IX) Carbonic anhydrase 9 precursor Carbonic anhydrase IX (CAIX) Carbonic anhydrases; II & IX MN RCC-associated antigen G250
Type:
Enzyme
Mol. Mass.:
49669.03
Organism:
Homo sapiens (Human)
Description:
Catalytic domain of human cloned isozyme was used in the assay
Residue:
459
  
Inhibitor
Name:
BDBM50190241
Synonyms:
6-mercapto-3,4-dihydro-2H-1,2,4-benzothiadiazine-7-sulfonamide 1,1-dioxide | CHEMBL215916
Type:
Small organic molecule
Emp. Form.:
C7H9N3O4S3
Mol. Mass.:
295.359
SMILES:
NS(=O)(=O)c1cc2c(NCNS2(=O)=O)cc1S
: