Target
Cytochrome P450 3A4
Ligand
BDBM50190529
Substrate
Meas. Tech.
ChEMBL_373752 (CHEMBL870973)
IC50
2500±n/a nM
Citation
 Borthwick, ADDavies, DEExall, AMHatley, RJHughes, JAIrving, WRLivermore, DGSollis, SLNerozzi, FValko, KLAllen, MJPerren, MShabbir, SSWoollard, PMPrice, MA 2,5-diketopiperazines as potent, selective, and orally bioavailable oxytocin antagonists. 3. Synthesis, pharmacokinetics, and in vivo potency. J Med Chem 49:4159-70 (2006)  
Target
Name:
Cytochrome P450 3A4
Synonyms:
Albendazole monooxygenase CP3A4_HUMAN CYP3A4 CYPIIIA4 Cytochrome P450 3A4 (CYP3A4) Nifedipine oxidase Taurochenodeoxycholate 6-alpha-hydroxylase
Type:
Enzyme
Mol. Mass.:
57349.57
Organism:
Homo sapiens (Human)
Description:
Residue:
503
  
Inhibitor
Name:
BDBM50190529
Synonyms:
(2R)-2-(1-benzofuran-5-yl)-2-[(3R,6R)-3-(2,3-dihydro-1H-inden-2-yl)-6-(2-methylpropyl)-2,5-dioxo-1-piperazinyl]-N-(1-methylethyl)ethanamide | CHEMBL208787
Type:
Small organic molecule
Emp. Form.:
C30H35N3O4
Mol. Mass.:
501.6166
SMILES:
CC(C)C[C@H]1N([C@@H](C(=O)NC(C)C)c2ccc3occc3c2)C(=O)[C@H](NC1=O)C1Cc2ccccc2C1
: