Target
Deoxyuridine 5'-triphosphate nucleotidohydrolase
Ligand
BDBM50190556
Substrate
Meas. Tech.
ChEMBL_373621 (CHEMBL869761)
Ki
200±n/a nM
Citation
 Nguyen, CRuda, GFSchipani, AKasinathan, GLeal, IMusso-Buendia, AKaiser, MBrun, RRuiz-Pérez, LMSahlberg, BLJohansson, NGGonzalez-Pacanowska, DGilbert, IH Acyclic nucleoside analogues as inhibitors of Plasmodium falciparum dUTPase. J Med Chem 49:4183-95 (2006)  
Target
Name:
Deoxyuridine 5'-triphosphate nucleotidohydrolase
Synonyms:
dUTP pyrophosphatase
Type:
Protein
Mol. Mass.:
19574.43
Organism:
Plasmodium falciparum
Description:
Q8II92
Residue:
173
  
Inhibitor
Name:
BDBM50190556
Synonyms:
1-(3-tritylaminopropyl)uracil | CHEMBL211905
Type:
Small organic molecule
Emp. Form.:
C26H25N3O2
Mol. Mass.:
411.4956
SMILES:
O=c1ccn(CCCNC(c2ccccc2)(c2ccccc2)c2ccccc2)c(=O)[nH]1
: