Target
Metabotropic glutamate receptor 6
Ligand
BDBM50060137
Substrate
Meas. Tech.
ChEMBL_400290 (CHEMBL912663)
EC50
18400±n/a nM
Citation
 Schann, SMenet, CArvault, PMercier, GFrauli, MMayer, SHubert, NTriballeau, NBertrand, HOAcher, FNeuville, P Design and synthesis of APTCs (aminopyrrolidinetricarboxylic acids): identification of a new group III metabotropic glutamate receptor selective agonist. Bioorg Med Chem Lett 16:4856-60 (2006)  
Target
Name:
Metabotropic glutamate receptor 6
Synonyms:
GRM6_RAT Grm6 Metabotropic glutamate receptor 6 (mGlu6) mGlu6 | metabotropic glutamate 6
Type:
Enzyme
Mol. Mass.:
95095.82
Organism:
Rattus norvegicus (Rat)
Description:
P35349
Residue:
871
  
Inhibitor
Name:
BDBM50060137
Synonyms:
(1R,2S)-4-aminocyclopentane-1,2,4-tricarboxylic acid (1S,2R,4S)-4-Amino-cyclopentane-1,2,4-tricarboxylic acid 4-Amino-cyclopentane-1,2,4-tricarboxylic acid | CHEMBL285043
Type:
Small organic molecule
Emp. Form.:
C8H11NO6
Mol. Mass.:
217.176
SMILES:
N[C@]1(C[C@@H]([C@@H](C1)C(O)=O)C(O)=O)C(O)=O
: