Target
5-hydroxytryptamine receptor 2B
Ligand
BDBM50191179
Substrate
Meas. Tech.
ChEMBL_399082 (CHEMBL909200)
IC50
16±n/a nM
Citation
 Bienaymé, HChêne, LGrisoni, SGrondin, AKaloun, el-BPoigny, SRahali, HTam, E New spiro-piperidines as 5-HT2B receptor antagonists. Bioorg Med Chem Lett 16:4830-3 (2006)  
Target
Name:
5-hydroxytryptamine receptor 2B
Synonyms:
5-HT-2B 5-hydroxytryptamine (serotonin) receptor 2B [Homo sapiens] 5-hydroxytryptamine receptor 2C (5HT2C) HTR2B Serotonin 2b (5-HT2b) receptor | Serotonin Receptor 2B
Type:
G Protein-Coupled Receptor (GPCR)
Mol. Mass.:
54312.47
Organism:
Homo sapiens (Human)
Description:
Receptor binding assays were performed using human clone stably expressed in CHO cells.
Residue:
481
  
Inhibitor
Name:
BDBM50191179
Synonyms:
1-(2-phenylethyl)-4'-(pyridin-4-yl)-8'-oxa-5',6'-diazaspiro[piperidine-4,7'-tricyclo[7.4.0.0^{2,6}]tridecane]-1'(13'),4',9',11'-tetraene | CHEMBL383860
Type:
Small organic molecule
Emp. Form.:
C27H28N4O
Mol. Mass.:
424.5374
SMILES:
C(Cc1ccccc1)N1CCC2(CC1)Oc1ccccc1C1CC(=NN21)c1ccncc1
: