Target
Metallo-beta-lactamase type 2
Ligand
BDBM50053173
Substrate
Meas. Tech.
ChEMBL_365444 (CHEMBL869111)
IC50
400000±n/a nM
Citation
 Venkatesan, AMAgarwal, AAbe, TUshirogochi, HYamamura, IAdo, MTsuyoshi, TDos Santos, OGu, YSum, FWLi, ZFrancisco, GLin, YIPetersen, PJYang, YKumagai, TWeiss, WJShlaes, DMKnox, JRMansour, TS Structure-activity relationship of 6-methylidene penems bearing 6,5 bicyclic heterocycles as broad-spectrum beta-lactamase inhibitors: evidence for 1,4-thiazepine intermediates with C7 R stereochemistry by computational methods. J Med Chem 49:4623-37 (2006)  
Target
Name:
Metallo-beta-lactamase type 2
Synonyms:
BLAB_BACFG ccrA | cfiA
Type:
PROTEIN
Mol. Mass.:
27252.87
Organism:
Bacteroides fragilis
Description:
ChEMBL_1502123
Residue:
249
  
Inhibitor
Name:
BDBM50053173
Synonyms:
(2S,3S,5R)-3-Methyl-4,4,7-trioxo-3-[1,2,3]triazol-1-ylmethyl-4-thia-1-aza-bicyclo[3.2.0]heptane-2-carboxylic acid (2S,3S,5R)-3-methyl-4,4,7-trioxo-3-[1,2,3]triazol-1-ylmethyl-4lambda6-thia-1-aza-bicyclo[3.2.0]heptane-2-carboxylic acid 3-Methyl-4,4,7-trioxo-3-[1,2,3]triazol-1-ylmethyl-4lambda*6*-thia-1-aza-bicyclo[3.2.0]heptane-2-carboxylic acid CL-298741 US9120808, Tazobactam sodium salt YTR-830H | Zosyn
Type:
Small organic molecule
Emp. Form.:
C10H12N4O5S
Mol. Mass.:
300.291
SMILES:
C[C@]1(Cn2ccnn2)[C@@H](N2[C@@H](CC2=O)S1(=O)=O)C(O)=O
: