Target
Steroid 17-alpha-hydroxylase/17,20 lyase
Ligand
BDBM50188088
Substrate
Meas. Tech.
ChEMBL_398339 (CHEMBL908004)
IC50
16550±n/a nM
Citation
 Patel, CHDhanani, SOwen, CPAhmed, S Synthesis, biochemical evaluation and rationalisation of the inhibitory activity of a range of 4-substituted phenyl alkyl imidazole-based inhibitors of the enzyme complex 17alpha-hydroxylase/17,20-lyase (P450(17alpha)). Bioorg Med Chem Lett 16:4752-6 (2006)  
Target
Name:
Steroid 17-alpha-hydroxylase/17,20 lyase
Synonyms:
CP17A_RAT Cyp17a1 Cytochrome P450 17A1 Steroid 17-alpha-hydroxylase/17,20 lyase
Type:
Enzyme
Mol. Mass.:
57255.68
Organism:
Rattus norvegicus (Rat)
Description:
P11715
Residue:
507
  
Inhibitor
Name:
BDBM50188088
Synonyms:
1-(4-bromobenzyl)-1H-imidazole | CHEMBL211207
Type:
Small organic molecule
Emp. Form.:
C10H9BrN2
Mol. Mass.:
237.096
SMILES:
Brc1ccc(Cn2ccnc2)cc1
: