Target
Steroid 17-alpha-hydroxylase/17,20 lyase
Ligand
BDBM50191796
Substrate
Meas. Tech.
ChEMBL_398339 (CHEMBL908004)
IC50
30950±n/a nM
Citation
 Patel, CHDhanani, SOwen, CPAhmed, S Synthesis, biochemical evaluation and rationalisation of the inhibitory activity of a range of 4-substituted phenyl alkyl imidazole-based inhibitors of the enzyme complex 17alpha-hydroxylase/17,20-lyase (P450(17alpha)). Bioorg Med Chem Lett 16:4752-6 (2006)  
Target
Name:
Steroid 17-alpha-hydroxylase/17,20 lyase
Synonyms:
CP17A_RAT Cyp17a1 Cytochrome P450 17A1 Steroid 17-alpha-hydroxylase/17,20 lyase
Type:
Enzyme
Mol. Mass.:
57255.68
Organism:
Rattus norvegicus (Rat)
Description:
P11715
Residue:
507
  
Inhibitor
Name:
BDBM50191796
Synonyms:
1-(3-phenylpropyl)-1H-imidazole | CHEMBL380271
Type:
Small organic molecule
Emp. Form.:
C12H14N2
Mol. Mass.:
186.253
SMILES:
C(Cc1ccccc1)Cn1ccnc1
: