Target
Glutamate receptor 4
Ligand
BDBM50191954
Substrate
Meas. Tech.
ChEMBL_393591 (CHEMBL856922)
EC50
225±n/a nM
Citation
 Zarrinmayeh, HTromiczak, EZimmerman, DMRankl, NHo, KHDominguez, ECastaño, AEscribano, AFernandez, CJimenez, AHornback, WJNisenbaum, ES A novel class of positive allosteric modulators of AMPA receptors: design, synthesis, and structure-activity relationships of 3-biphenyl-4-yl-4-cyano-5-ethyl-1-methyl-1H-pyrrole-2-carboxylic acid, LY2059346. Bioorg Med Chem Lett 16:5203-6 (2006)  
Target
Name:
Glutamate receptor 4
Synonyms:
GLUR4 GRIA4_HUMAN Glutamate receptor ionotropic AMPA | Glutamate receptor ionotropic, AMPA 4
Type:
PROTEIN
Mol. Mass.:
100881.87
Organism:
Homo sapiens (Human)
Description:
ChEMBL_468628
Residue:
902
  
Inhibitor
Name:
BDBM50191954
Synonyms:
3-(2'-chloro-biphenyl-4-yl)-4-cyano-5-ethyl-1-methyl-1H-pyrrole-2-carboxylic acid | CHEMBL384402
Type:
Small organic molecule
Emp. Form.:
C21H17ClN2O2
Mol. Mass.:
364.825
SMILES:
CCc1c(C#N)c(c(C(O)=O)n1C)-c1ccc(cc1)-c1ccccc1Cl
: