Target
Metallo-beta-lactamase L1 type 3
Ligand
BDBM50192002
Substrate
Meas. Tech.
ChEMBL_392530 (CHEMBL864291)
Ki
200±n/a nM
Citation
 Sun, QLaw, ACrowder, MWGeysen, HM Homo-cysteinyl peptide inhibitors of the L1 metallo-beta-lactamase, and SAR as determined by combinatorial library synthesis. Bioorg Med Chem Lett 16:5169-75 (2006)  
Target
Name:
Metallo-beta-lactamase L1 type 3
Synonyms:
BLA1_STEMA | Beta-lactamase L1
Type:
PROTEIN
Mol. Mass.:
30803.13
Organism:
Stenotrophomonas maltophilia
Description:
ChEMBL_1500319
Residue:
290
  
Inhibitor
Name:
BDBM50192002
Synonyms:
(2R)-2-(2-(4-(benzyloxy)-3,5-dimethylbenzamido)-4-mercaptobutanamido)-3-phenylpropanoic acid | CHEMBL214517
Type:
Small organic molecule
Emp. Form.:
C29H32N2O5S
Mol. Mass.:
520.64
SMILES:
Cc1cc(cc(C)c1OCc1ccccc1)C(=O)NC(CCS)C(=O)N[C@H](Cc1ccccc1)C(O)=O
: