Target
Photoreceptor-specific nuclear receptor
Ligand
BDBM50192200
Substrate
Meas. Tech.
ChEMBL_401902 (CHEMBL906905)
EC50
4200±n/a nM
Citation
 Wolkenberg, SEZhao, ZKapitskaya, MWebber, ALPetrukhin, KTang, YSDean, DCHartman, GDLindsley, CW Identification of potent agonists of photoreceptor-specific nuclear receptor (NR2E3) and preparation of a radioligand. Bioorg Med Chem Lett 16:5001-4 (2006)  
Target
Name:
Photoreceptor-specific nuclear receptor
Synonyms:
NR2E3 PNR photoreceptor-specific nuclear receptor
Type:
PROTEIN
Mol. Mass.:
44699.83
Organism:
Homo sapiens (Human)
Description:
ChEMBL_401901
Residue:
410
  
Inhibitor
Name:
BDBM50192200
Synonyms:
2-chloro-N-(2-(3,5-dichloro-2-hydroxyphenyl)-1H-benzo[d]imidazol-5-yl)benzamide | CHEMBL386447
Type:
Small organic molecule
Emp. Form.:
C20H12Cl3N3O2
Mol. Mass.:
432.687
SMILES:
Oc1c(Cl)cc(Cl)cc1-c1nc2ccc(NC(=O)c3ccccc3Cl)cc2[nH]1
: