Target
Glutamate receptor 4
Ligand
BDBM50192214
Substrate
Meas. Tech.
ChEMBL_391775 (CHEMBL869262)
EC50
440±n/a nM
Citation
 Fernandez, MCCastaño, ADominguez, EEscribano, AJiang, DJimenez, AHong, EHornback, WJNisenbaum, ESRankl, NTromiczak, EVaught, GZarrinmayeh, HZimmerman, DM A novel class of AMPA receptor allosteric modulators. Part 1: design, synthesis, and SAR of 3-aryl-4-cyano-5-substituted-heteroaryl-2-carboxylic acid derivatives. Bioorg Med Chem Lett 16:5057-61 (2006)  
Target
Name:
Glutamate receptor 4
Synonyms:
GLUR4 GRIA4_HUMAN Glutamate receptor ionotropic AMPA | Glutamate receptor ionotropic, AMPA 4
Type:
PROTEIN
Mol. Mass.:
100881.87
Organism:
Homo sapiens (Human)
Description:
ChEMBL_468628
Residue:
902
  
Inhibitor
Name:
BDBM50192214
Synonyms:
3-(4-tert-butylphenyl)-4-cyano-5-(ethylthio)thiophene-2-carboxylic acid | CHEMBL215987
Type:
Small organic molecule
Emp. Form.:
C18H19NO2S2
Mol. Mass.:
345.479
SMILES:
CCSc1sc(C(O)=O)c(c1C#N)-c1ccc(cc1)C(C)(C)C
: