Target
Glutamate receptor 2
Ligand
BDBM50191959
Substrate
Meas. Tech.
ChEMBL_391777 (CHEMBL871564)
EC50
97±n/a nM
Citation
 Fernandez, MCCastaño, ADominguez, EEscribano, AJiang, DJimenez, AHong, EHornback, WJNisenbaum, ESRankl, NTromiczak, EVaught, GZarrinmayeh, HZimmerman, DM A novel class of AMPA receptor allosteric modulators. Part 1: design, synthesis, and SAR of 3-aryl-4-cyano-5-substituted-heteroaryl-2-carboxylic acid derivatives. Bioorg Med Chem Lett 16:5057-61 (2006)  
Target
Name:
Glutamate receptor 2
Synonyms:
AMPA-selective glutamate receptor 2 GRIA2 GluR-2 GluR-K2 Glutamate receptor 2 Glutamate receptor AMPA 2/3 Glutamate receptor ionotropic, AMPA 2
Type:
Enzyme Catalytic Domain
Mol. Mass.:
98825.96
Organism:
Homo sapiens (Human)
Description:
Glutamate AMPA 2 GRIA2 HUMAN::P42262
Residue:
883
  
Inhibitor
Name:
BDBM50191959
Synonyms:
3-(4-tert-butylphenyl)-4-cyano-5-(methylthio)thiophene-2-carboxylic acid CHEMBL213197
Type:
Small organic molecule
Emp. Form.:
C17H17NO2S2
Mol. Mass.:
331.452
SMILES:
CSc1sc(C(O)=O)c(c1C#N)-c1ccc(cc1)C(C)(C)C
: