Target
Tyrosine-protein kinase Fyn
Ligand
BDBM50192782
Substrate
Meas. Tech.
ChEMBL_422240 (CHEMBL856508)
IC50
40±n/a nM
Citation
 McDonald, OLackey, KDavis-Ward, RWood, ESamano, VMaloney, PDeanda, FHunter, R Aza-stilbenes as potent and selective c-RAF inhibitors. Bioorg Med Chem Lett 16:5378-83 (2006)  
Target
Name:
Tyrosine-protein kinase Fyn
Synonyms:
FYN_MOUSE | Fyn
Type:
PROTEIN
Mol. Mass.:
60675.13
Organism:
Mus musculus
Description:
ChEMBL_422240
Residue:
537
  
Inhibitor
Name:
BDBM50192782
Synonyms:
3,5-dimethyl-4-{(E)-2-[5-(1H-tetrazol-5-yl)-3-pyridinyl]ethenyl}phenol | CHEMBL218791
Type:
Small organic molecule
Emp. Form.:
C16H15N5O
Mol. Mass.:
293.3232
SMILES:
Cc1cc(O)cc(C)c1C=Cc1cncc(c1)-c1nnn[nH]1
: