Target
Synaptic vesicular amine transporter
Ligand
BDBM50192902
Substrate
Meas. Tech.
ChEMBL_404073 (CHEMBL909739)
Ki
28±n/a nM
Citation
 Zheng, GHorton, DBDeaciuc, AGDwoskin, LPCrooks, PA Des-keto lobeline analogs with increased potency and selectivity at dopamine and serotonin transporters. Bioorg Med Chem Lett 16:5018-21 (2006)  
Target
Name:
Synaptic vesicular amine transporter
Synonyms:
Monoamine transporter Solute carrier family 18 member 2 Synaptic vesicular amine transporter VMAT2_RAT Vesicular monoamine transporter 2 (VMAT2) | Vmat2
Type:
Protein
Mol. Mass.:
55689.58
Organism:
Rattus norvegicus (Rat)
Description:
Q01827
Residue:
515
  
Inhibitor
Name:
BDBM50192902
Synonyms:
2-ethyl-3-isobutyl-9,10-dimethoxy-2,3,4,6,7,11b-hexahydro-1H-pyrido[2,1-a]isoquinolin-2-ol Ro-4-1284
Type:
Small organic molecule
Emp. Form.:
C21H33NO3
Mol. Mass.:
347.4916
SMILES:
CCC1(O)CC2N(CCc3cc(OC)c(OC)cc23)CC1CC(C)C
: