Target
Bifunctional epoxide hydrolase 2
Ligand
BDBM50143930
Substrate
Meas. Tech.
ChEMBL_422305 (CHEMBL856477)
IC50
33000±n/a nM
Citation
 Morisseau, CNewman, JWTsai, HJBaecker, PAHammock, BD Peptidyl-urea based inhibitors of soluble epoxide hydrolases. Bioorg Med Chem Lett 16:5439-44 (2006)  
Target
Name:
Bifunctional epoxide hydrolase 2
Synonyms:
Eph2 Epoxide hydratase Soluble epoxide hydrolase (sEH)
Type:
Enzyme
Mol. Mass.:
62512.06
Organism:
Mus musculus (Mouse)
Description:
P34914
Residue:
554
  
Inhibitor
Name:
BDBM50143930
Synonyms:
(3-Cyclohexyl-ureido)-acetic acid methyl ester methyl 2-(3-cyclohexylureido)acetate
Type:
Small organic molecule
Emp. Form.:
C10H18N2O3
Mol. Mass.:
214.2615
SMILES:
COC(=O)CNC(=O)NC1CCCCC1
: