Target
Cyclin-dependent kinase 2
Ligand
BDBM5594
Substrate
Meas. Tech.
ChEMBL_383686 (CHEMBL854531)
Ki
2400±n/a nM
Citation
 Heady, LFernandez-Serra, MMancera, RLJoyce, SVenkitaraman, ARArtacho, ESkylaris, CKCiacchi, LCPayne, MC Novel structural features of CDK inhibition revealed by an ab initio computational method combined with dynamic simulations. J Med Chem 49:5141-53 (2006)  
Target
Name:
Cyclin-dependent kinase 2
Synonyms:
CDK2 CDK2_HUMAN Cell division protein kinase 2 Protein cereblon/Cyclin-dependent kinase 2 | p33 protein kinase
Type:
Enzyme Subunit
Mol. Mass.:
33938.17
Organism:
Homo sapiens (Human)
Description:
P24941
Residue:
298
  
Inhibitor
Name:
BDBM5594
Synonyms:
2-arylamino-pyrimidine deriv. 9d CHEMBL101801
Type:
Small organic molecule
Emp. Form.:
C18H22N6O3
Mol. Mass.:
370.4057
SMILES:
NC(=O)c1ccc(Nc2nc(N)c(N=O)c(OCC3CCCCC3)n2)cc1
: