Target
Calpain-1 catalytic subunit
Ligand
BDBM50193500
Substrate
Meas. Tech.
ChEMBL_386232 (CHEMBL869269)
Ki
280±n/a nM
Citation
 Korukonda, RGuan, NDalton, JTLiu, JDonkor, IO Synthesis, calpain inhibitory activity, and cytotoxicity of P2-substituted proline and thiaproline peptidyl aldehydes and peptidyl alpha-ketoamides. J Med Chem 49:5282-90 (2006)  
Target
Name:
Calpain-1 catalytic subunit
Synonyms:
CAN1_PIG CAPN1 Calpain 1 Calpain-1 Calpain-1 large subunit muCANP
Type:
Catalytic subunit; forms a heterodimer with a small (regulatory) subunit (CAPNS1)
Mol. Mass.:
81729.82
Organism:
Sus scrofa (pig)
Description:
Native calpain-1 from porcine erythrocytes, purchased from Calbiochem, was used in assay.
Residue:
714
  
Inhibitor
Name:
BDBM50193500
Synonyms:
(R)-N-(2(R,S)-3,4-dioxo-4-(phenethylamino)-1-phenylbutan-2-yl)-1-(4-nitrophenyl-sulfonylpyrrolidine-2-carboxamide | CHEMBL426143
Type:
Small organic molecule
Emp. Form.:
C29H30N4O7S
Mol. Mass.:
578.636
SMILES:
[O-][N+](=O)c1ccc(cc1)S(=O)(=O)N1CCC[C@@H]1C(=O)NC(Cc1ccccc1)C(=O)C(=O)NCCc1ccccc1
: