Target
Tyrosinase
Ligand
BDBM50031467
Substrate
Meas. Tech.
ChEMBL_424044 (CHEMBL854613)
IC50
133400±n/a nM
Citation
 Likhitwitayawuid, KSornsute, ASritularak, BPloypradith, P Chemical transformations of oxyresveratrol (trans-2,4,3',5'-tetrahydroxystilbene) into a potent tyrosinase inhibitor and a strong cytotoxic agent. Bioorg Med Chem Lett 16:5650-3 (2006)  
Target
Name:
Tyrosinase
Synonyms:
LB24-AB SK29-AB TYRO_HUMAN | Tumor rejection antigen AB
Type:
Protein
Mol. Mass.:
60388.08
Organism:
Homo sapiens (Human)
Description:
P14679
Residue:
529
  
Inhibitor
Name:
BDBM50031467
Synonyms:
5-HYDROXY-2-(HYDROXYMETHYL)-4H-PYRAN-4-ONE CHEMBL287556 US10857082, Kojic acid US9682910, kojic acid
Type:
Small organic molecule
Emp. Form.:
C6H6O4
Mol. Mass.:
142.1094
SMILES:
OCc1cc(=O)c(O)co1
: