Target
Dual specificity mitogen-activated protein kinase kinase 1
Ligand
BDBM50194041
Substrate
Meas. Tech.
ChEMBL_420098 (CHEMBL873740)
EC50
75±n/a nM
Citation
 El Abdellaoui, HVaraprasad, CVBarawkar, DChakravarty, SMaderna, ATam, RChen, HAllan, MWu, JZAppleby, TYan, SZhang, WLang, SYao, NHamatake, RHong, Z Identification of isothiazole-4-carboxamidines derivatives as a novel class of allosteric MEK1 inhibitors. Bioorg Med Chem Lett 16:5561-6 (2006)  
Target
Name:
Dual specificity mitogen-activated protein kinase kinase 1
Synonyms:
Dual specificity mitogen-activated protein kinase (MEK) Dual specificity mitogen-activated protein kinase kinase 1 (MEK1) Dual specificity mitogen-activated protein kinase kinase MEK1/2 MAP kinase kinase 1 MAPK/ERK kinase 1 MEK-1 MP2K1_HUMAN PRKMK1 | VHL-MAP2K1/MAP2K2
Type:
Other Protein Type
Mol. Mass.:
43439.03
Organism:
Homo sapiens (Human)
Description:
Full-length human MEK-1 was generated by PCR and purified as a fusion protein from Escherichia coli lysates.
Residue:
393
  
Inhibitor
Name:
BDBM50194041
Synonyms:
5-4-2,5-dichlorophenoxy)phenylamino)-3-hydroxy-N-2-hydroxypropyl)isothiazole-4-carboximidamide | CHEMBL385905
Type:
Small organic molecule
Emp. Form.:
C19H18Cl2N4O3S
Mol. Mass.:
453.342
SMILES:
CC(O)CN=C(N)c1c(Nc2ccc(Oc3cc(Cl)ccc3Cl)cc2)s[nH]c1=O
: