Target
Carboxylic ester hydrolase
Ligand
BDBM50194105
Substrate
Meas. Tech.
ChEMBL_400868 (CHEMBL868066)
IC50
7.6±n/a nM
Citation
 Decker, M Homobivalent quinazolinimines as novel nanomolar inhibitors of cholinesterases with dirigible selectivity toward butyrylcholinesterase. J Med Chem 49:5411-3 (2006)  
Target
Name:
Carboxylic ester hydrolase
Synonyms:
BuChE Butyrylcholine esterase Butyrylcholinesterase (BChE) Butyrylcholinesterase (EqBuChE) butyrylcholinesterase precursor
Type:
Protein
Mol. Mass.:
68842.83
Organism:
Equus caballus (Horse)
Description:
Q9N1N9
Residue:
602
  
Inhibitor
Name:
BDBM50194105
Synonyms:
CHEMBL213850 | N,N'-bis[6,7,8,9-tetrahydro-11H-pyrido[2,1-b]quinazolin-11-ylidene]octane-1,8-diamine
Type:
Small organic molecule
Emp. Form.:
C32H40N6
Mol. Mass.:
508.7002
SMILES:
C(CCCC\N=c1/n2CCCCc2nc2ccccc12)CCC\N=c1/n2CCCCc2nc2ccccc12
: