Target
Glutamate receptor 1
Ligand
BDBM50194113
Substrate
Meas. Tech.
ChEMBL_403341 (CHEMBL868048)
Ki
13±n/a nM
Citation
 Andersen, TFTikhonov, DBBølcho, UBolshakov, KNelson, JKPluteanu, FMellor, IREgebjerg, JStrømgaard, K Uncompetitive antagonism of AMPA receptors: Mechanistic insights from studies of polyamine toxin derivatives. J Med Chem 49:5414-23 (2006)  
Target
Name:
Glutamate receptor 1
Synonyms:
AMPA-selective glutamate receptor 1 GluA1 GluR-A Glur1 Gria1
Type:
Protein
Mol. Mass.:
101583.91
Organism:
Rattus norvegicus (Rat)
Description:
P19490
Residue:
907
  
Inhibitor
Name:
BDBM50194113
Synonyms:
(S)-N-(1-(5-(4-aminobutylamino)pentylamino)-3-(4-hydroxyphenyl)-1-oxopropan-2-yl)butyramide | CHEMBL214086
Type:
Small organic molecule
Emp. Form.:
C22H38N4O3
Mol. Mass.:
406.5621
SMILES:
CCCC(=O)N[C@@H](Cc1ccc(O)cc1)C(=O)NCCCCCNCCCCN
: