Target
Collagenase 3
Ligand
BDBM50194279
Substrate
Meas. Tech.
ChEMBL_424298 (CHEMBL910078)
IC50
7200±n/a nM
Citation
 Reiter, LAFreeman-Cook, KDJones, CSMartinelli, GJAntipas, ASBerliner, MADatta, KDowns, JTEskra, JDForman, MDGreer, EMGuzman, RHardink, JRJanat, FKeene, NFLaird, ERLiras, JLLopresti-Morrow, LLMitchell, PGPandit, JRobertson, DSperger, DVaughn-Bowser, MLWaller, DMYocum, SA Potent, selective pyrimidinetrione-based inhibitors of MMP-13. Bioorg Med Chem Lett 16:5822-6 (2006)  
Target
Name:
Collagenase 3
Synonyms:
Collagenase 3 MMP13_RAT Matrix metalloproteinase-13 UMRCASE
Type:
PROTEIN
Mol. Mass.:
53359.23
Organism:
Rattus norvegicus
Description:
ChEMBL_424298
Residue:
466
  
Inhibitor
Name:
BDBM50194279
Synonyms:
4-(2-(4-(4-(5-(2-methoxyethyl)-2,4,6-trioxo-hexahydropyrimidin-5-yloxy)phenoxy)phenyl)oxazol-4-yl)benzonitrile CHEMBL222077
Type:
Small organic molecule
Emp. Form.:
C29H22N4O7
Mol. Mass.:
538.5076
SMILES:
COCCC1(Oc2ccc(Oc3ccc(cc3)-c3nc(co3)-c3ccc(cc3)C#N)cc2)C(=O)NC(=O)NC1=O
: