Target
Glycogen phosphorylase, liver form
Ligand
BDBM50194422
Substrate
Meas. Tech.
ChEMBL_424360 (CHEMBL909563)
IC50
806±n/a nM
Citation
 Whittamore, PRAddie, MSBennett, SNBirch, AMButters, MGodfrey, LKenny, PWMorley, ADMurray, PMOikonomakos, NGOtterbein, LRPannifer, ADParker, JSReadman, KSiedlecki, PSSchofield, PStocker, ATaylor, MJTownsend, LAWhalley, DPWhitehouse, J Novel thienopyrrole glycogen phosphorylase inhibitors: synthesis, in vitro SAR and crystallographic studies. Bioorg Med Chem Lett 16:5567-71 (2006)  
Target
Name:
Glycogen phosphorylase, liver form
Synonyms:
Glycogen Phosphorylase (PYGL) Liver glycogen phosphorylase PYGL_HUMAN
Type:
Homodimer
Mol. Mass.:
97153.98
Organism:
Homo sapiens (Human)
Description:
Dimers associate into a tetramer to form the enzymatically active phosphorylase A.
Residue:
847
  
Inhibitor
Name:
BDBM50194422
Synonyms:
2-chloro-N-(2,3-dihydro-1H-inden-2-yl)-6H-thieno[2,3-b]pyrrole-5-carboxamide | CHEMBL218492
Type:
Small organic molecule
Emp. Form.:
C16H13ClN2OS
Mol. Mass.:
316.805
SMILES:
Clc1cc2cc([nH]c2s1)C(=O)NC1Cc2ccccc2C1
: