Target
Neuromedin-K receptor
Ligand
BDBM50194564
Substrate
Meas. Tech.
ChEMBL_424424 (CHEMBL910703)
IC50
1.6±n/a nM
Citation
 Elliott, JMCarling, RWChicchi, GGCrawforth, JHutson, PHJones, ABKelly, SMarwood, RMeneses-Lorente, GMezzogori, EMurray, FRigby, MRoyo, IRussell, MGShaw, DSohal, BTsao, KLWilliams, B N',2-diphenylquinoline-4-carbohydrazide based NK3 receptor antagonists II. Bioorg Med Chem Lett 16:5752-6 (2006)  
Target
Name:
Neuromedin-K receptor
Synonyms:
NK-3 receptor NK3R NKR Neurokinin B receptor Neuromedin-3 receptor (NK-3R) Neuromedin-K receptor Neuromedin-K receptor (NK3) TAC3R Tachykinin receptor 3 | Tachykinin receptor 3 (NK3)
Type:
Enzyme
Mol. Mass.:
52221.96
Organism:
Homo sapiens (Human)
Description:
P29371
Residue:
465
  
Inhibitor
Name:
BDBM50194564
Synonyms:
CHEMBL374307 | N'-[3-(4-benzyl-piperazin-1-ylmethyl)-2-phenyl-quinoline-4-carbonyl]-N-phenyl-hydrazinecarboxylic acid methyl ester
Type:
Small organic molecule
Emp. Form.:
C36H35N5O3
Mol. Mass.:
585.6948
SMILES:
COC(=O)N(NC(=O)c1c(CN2CCN(Cc3ccccc3)CC2)c(nc2ccccc12)-c1ccccc1)c1ccccc1
: