Target
Peroxisome proliferator-activated receptor gamma
Ligand
BDBM50194638
Substrate
Meas. Tech.
ChEMBL_396485 (CHEMBL911539)
EC50
46±n/a nM
Citation
 Xu, YEtgen, GJBroderick, CLCanada, EGonzalez, ILamar, JMontrose-Rafizadeh, COldham, BAOsborne, JJXie, CShi, QWinneroski, LLYork, JYumibe, NZink, RMantlo, N Design and synthesis of dual peroxisome proliferator-activated receptors gamma and delta agonists as novel euglycemic agents with a reduced weight gain profile. J Med Chem 49:5649-52 (2006)  
Target
Name:
Peroxisome proliferator-activated receptor gamma
Synonyms:
NR1C3 PPAR-gamma PPARG_HUMAN Peroxisome proliferator-activated receptor gamma (PPAR gamma) Peroxisome proliferator-activated receptor gamma (PPARĪ³) peroxisome proliferator-activated receptor gamma isoform 2
Type:
Nuclear Receptor
Mol. Mass.:
57613.46
Organism:
Homo sapiens (Human)
Description:
P37231
Residue:
505
  
Inhibitor
Name:
BDBM50194638
Synonyms:
3-{4-[3-(2-benzoyl-4-ethyl-phenoxy)-pentyloxy]-2-methyl-phenyl}-propionic acid | CHEMBL215127
Type:
Small organic molecule
Emp. Form.:
C30H34O5
Mol. Mass.:
474.588
SMILES:
CCC(CCOc1ccc(CCC(O)=O)c(C)c1)Oc1ccc(CC)cc1C(=O)c1ccccc1
: