Target
Peroxisome proliferator-activated receptor alpha
Ligand
BDBM50194634
Substrate
Meas. Tech.
ChEMBL_396483 (CHEMBL911537)
EC50
1529±n/a nM
Citation
 Xu, YEtgen, GJBroderick, CLCanada, EGonzalez, ILamar, JMontrose-Rafizadeh, COldham, BAOsborne, JJXie, CShi, QWinneroski, LLYork, JYumibe, NZink, RMantlo, N Design and synthesis of dual peroxisome proliferator-activated receptors gamma and delta agonists as novel euglycemic agents with a reduced weight gain profile. J Med Chem 49:5649-52 (2006)  
Target
Name:
Peroxisome proliferator-activated receptor alpha
Synonyms:
NR1C1 PPAR PPAR-alpha PPARA_HUMAN Peroxisome proliferator-activated receptor | Peroxisome proliferator-activated receptor alpha (PPAR alpha)
Type:
Enzyme
Mol. Mass.:
52222.08
Organism:
Homo sapiens (Human)
Description:
Q07869
Residue:
468
  
Inhibitor
Name:
BDBM50194634
Synonyms:
3-{4-[3-(2-benzoyl-4-ethyl-phenoxy)-butoxy]-2-methyl-phenyl}-propionic acid | CHEMBL378068
Type:
Small organic molecule
Emp. Form.:
C29H32O5
Mol. Mass.:
460.5614
SMILES:
CCc1ccc(OC(C)CCOc2ccc(CCC(O)=O)c(C)c2)c(c1)C(=O)c1ccccc1
: