Target
RAC-alpha serine/threonine-protein kinase
Ligand
BDBM50194671
Substrate
Meas. Tech.
ChEMBL_396656 (CHEMBL871549)
IC50
>25000±n/a nM
Citation
 DiMauro, EFNewcomb, JNunes, JJBemis, JEBoucher, CBuchanan, JLBuckner, WHCee, VJChai, LDeak, HLEpstein, LFFaust, TGallant, PGeuns-Meyer, SDGore, AGu, YHenkle, BHodous, BLHsieh, FHuang, XKim, JLLee, JHMartin, MWMasse, CEMcGowan, DCMetz, DMohn, DMorgenstern, KAOliveira-dos-Santos, APatel, VFPowers, DRose, PESchneider, STomlinson, SATudor, YYTurci, SMWelcher, AAWhite, RDZhao, HZhu, LZhu, X Discovery of aminoquinazolines as potent, orally bioavailable inhibitors of Lck: synthesis, SAR, and in vivo anti-inflammatory activity. J Med Chem 49:5671-86 (2006)  
Target
Name:
RAC-alpha serine/threonine-protein kinase
Synonyms:
AKT phosphorylation (p-AKT) AKT1/PPP1CA C-AKT PKB alpha Protein kinase B Protein kinase B (Akt 1) Protein kinase B alpha Proto-oncogene Akt (Akt1) Proto-oncogene c-Akt (AKT1) RAC-PK-alpha RAC-alpha serine/threonine-protein kinase (AKT1) | RAC-alpha serine/threonine-protein kinase (pAKT)
Type:
Enzyme
Mol. Mass.:
55681.25
Organism:
Homo sapiens (Human)
Description:
P31749
Residue:
480
  
Inhibitor
Name:
BDBM50194671
Synonyms:
4-methyl-3-(2-(methylamino)quinazolin-6-yl)-N-(2-(1-methylpiperidin-4-yloxy)-5-(trifluoromethyl)phenyl)benzamide | CHEMBL386661
Type:
Small organic molecule
Emp. Form.:
C30H30F3N5O2
Mol. Mass.:
549.5867
SMILES:
CNc1ncc2cc(ccc2n1)-c1cc(ccc1C)C(=O)Nc1cc(ccc1OC1CCN(C)CC1)C(F)(F)F
: