Target
Serine/threonine-protein kinase PAK 2
Ligand
BDBM50194668
Substrate
Meas. Tech.
ChEMBL_396650 (CHEMBL871543)
IC50
>25000±n/a nM
Citation
 DiMauro, EFNewcomb, JNunes, JJBemis, JEBoucher, CBuchanan, JLBuckner, WHCee, VJChai, LDeak, HLEpstein, LFFaust, TGallant, PGeuns-Meyer, SDGore, AGu, YHenkle, BHodous, BLHsieh, FHuang, XKim, JLLee, JHMartin, MWMasse, CEMcGowan, DCMetz, DMohn, DMorgenstern, KAOliveira-dos-Santos, APatel, VFPowers, DRose, PESchneider, STomlinson, SATudor, YYTurci, SMWelcher, AAWhite, RDZhao, HZhu, LZhu, X Discovery of aminoquinazolines as potent, orally bioavailable inhibitors of Lck: synthesis, SAR, and in vivo anti-inflammatory activity. J Med Chem 49:5671-86 (2006)  
Target
Name:
Serine/threonine-protein kinase PAK 2
Synonyms:
PAK2 Serine/threonine-protein kinase PAK 1/PAK 2/PAK 3 Serine/threonine-protein kinase PAK 2 (PAK2) | p21-Activated kinase 2 (PAK2)
Type:
Enzyme
Mol. Mass.:
58037.40
Organism:
Homo sapiens (Human)
Description:
Q13177
Residue:
524
  
Inhibitor
Name:
BDBM50194668
Synonyms:
4-methyl-3-(2-(2-morpholinoethylamino)quinazolin-6-yl)-N-(3-(trifluoromethyl)phenyl)benzamide | CHEMBL215943
Type:
Small organic molecule
Emp. Form.:
C29H28F3N5O2
Mol. Mass.:
535.5601
SMILES:
Cc1ccc(cc1-c1ccc2nc(NCCN3CCOCC3)ncc2c1)C(=O)Nc1cccc(c1)C(F)(F)F
: