Target
Glycogen phosphorylase, liver form
Ligand
BDBM50194702
Substrate
Meas. Tech.
ChEMBL_399835 (CHEMBL910310)
IC50
1220±n/a nM
Citation
 Oikonomakos, NGTiraidis, CLeonidas, DDZographos, SEKristiansen, MJessen, CUNørskov-Lauritsen, LAgius, L Iminosugars as potential inhibitors of glycogenolysis: structural insights into the molecular basis of glycogen phosphorylase inhibition. J Med Chem 49:5687-701 (2006)  
Target
Name:
Glycogen phosphorylase, liver form
Synonyms:
Glycogen phosphorylase, liver form Liver glycogen phosphorylase Pygl
Type:
PROTEIN
Mol. Mass.:
97489.46
Organism:
Rattus norvegicus
Description:
ChEMBL_1491377
Residue:
850
  
Inhibitor
Name:
BDBM50194702
Synonyms:
(3R,4R,5R)-5-(HYDROXYMETHYL)-1-(3-PHENYLPROPYL)PIPERIDINE-3,4-DIOL CHEMBL213661
Type:
Small organic molecule
Emp. Form.:
C15H23NO3
Mol. Mass.:
265.348
SMILES:
OC[C@H]1CN(CCCc2ccccc2)C[C@@H](O)[C@@H]1O
: