Target
Glycogen phosphorylase, muscle form
Ligand
BDBM50194701
Substrate
Meas. Tech.
ChEMBL_399833 (CHEMBL910308)
IC50
390±n/a nM
Citation
 Oikonomakos, NGTiraidis, CLeonidas, DDZographos, SEKristiansen, MJessen, CUNørskov-Lauritsen, LAgius, L Iminosugars as potential inhibitors of glycogenolysis: structural insights into the molecular basis of glycogen phosphorylase inhibition. J Med Chem 49:5687-701 (2006)  
Target
Name:
Glycogen phosphorylase, muscle form
Synonyms:
Glycogen Phosphorylase (PYGM) Glycogen phosphorylase, muscle form PYGM | PYGM_RABIT
Type:
Enzyme
Mol. Mass.:
97296.32
Organism:
Oryctolagus cuniculus (rabbit)
Description:
Phosphorylation of Ser-15 converts phosphorylase B (unphosphorylated) to phosphorylase A.
Residue:
843
  
Inhibitor
Name:
BDBM50194701
Synonyms:
(2R,3R,4R)-2-Hydroxymethylpyrrolidin-3,4-diol hydrochloride | CHEMBL215137
Type:
Small organic molecule
Emp. Form.:
C5H12NO3
Mol. Mass.:
134.1531
SMILES:
OC[C@H]1[NH2+]C[C@@H](O)[C@@H]1O
: