Target
Urokinase-type plasminogen activator
Ligand
BDBM50194742
Substrate
Meas. Tech.
ChEBML_398430
IC50
5±n/a nM
Citation
 Joossens, JVan der Veken, PSurpateanu, GLambeir, AMEl-Sayed, IAli, OMAugustyns, KHaemers, A Diphenyl phosphonate inhibitors for the urokinase-type plasminogen activator: optimization of the P4 position. J Med Chem 49:5785-93 (2006)  
Target
Name:
Urokinase-type plasminogen activator
Synonyms:
PLAU UROK_HUMAN Urokinase-type plasminogen activator (uPA) | Urokinase-type plasminogen activator/surface receptor
Type:
Enzyme
Mol. Mass.:
48528.62
Organism:
Homo sapiens (Human)
Description:
P00749
Residue:
431
  
Inhibitor
Name:
BDBM50194742
Synonyms:
CHEMBL263977 | diphenyl 1-[(N-benzyl-D-seryl)-L-alanyl]amino-2-(4-guanidinophenyl)ethanephosphonate
Type:
Small organic molecule
Emp. Form.:
C34H37N6O7P
Mol. Mass.:
672.6673
SMILES:
[#6]-[#6@H](-[#7]-[#6](=O)-[#6@@H](-[#6]-[#8])-[#7]-[#6](=O)-c1ccccc1)-[#6](=O)-[#7]-[#6](-[#6]-c1ccc(cc1)\[#7]=[#6](\[#7])-[#7])P(=O)([#8]-c1ccccc1)[#8]-c1ccccc1
: