Target
Acetyl-CoA carboxylase 1
Ligand
BDBM50195050
Substrate
Meas. Tech.
ChEMBL_424666 (CHEMBL855116)
IC50
>30000±n/a nM
Citation
 Clark, RFZhang, TXin, ZLiu, GWang, YHansen, TMWang, XWang, RZhang, XFrevert, EUCamp, HSBeutel, BASham, HLGu, YG Structure-activity relationships for a novel series of thiazolyl phenyl ether derivatives exhibiting potent and selective acetyl-CoA carboxylase 2 inhibitory activity. Bioorg Med Chem Lett 16:6078-81 (2006)  
Target
Name:
Acetyl-CoA carboxylase 1
Synonyms:
ACAC ACACA_HUMAN ACC1 Acetyl-CoA carboxylase 1 | Acetyl-CoA carboxylase 1 (ACC1)
Type:
Protein
Mol. Mass.:
265543.22
Organism:
Homo sapiens (Human)
Description:
Q13085
Residue:
2346
  
Inhibitor
Name:
BDBM50195050
Synonyms:
CHEMBL220437 | N-(4-(2-(2-methoxyphenoxy)thiazol-5-yl)but-3-yn-2-yl)acetamide
Type:
Small organic molecule
Emp. Form.:
C16H16N2O3S
Mol. Mass.:
316.375
SMILES:
COc1ccccc1Oc1ncc(s1)C#CC(C)NC(C)=O
: