Target
Acetyl-CoA carboxylase 1
Ligand
BDBM50189617
Substrate
Meas. Tech.
ChEMBL_424666 (CHEMBL855116)
IC50
410±n/a nM
Citation
 Clark, RFZhang, TXin, ZLiu, GWang, YHansen, TMWang, XWang, RZhang, XFrevert, EUCamp, HSBeutel, BASham, HLGu, YG Structure-activity relationships for a novel series of thiazolyl phenyl ether derivatives exhibiting potent and selective acetyl-CoA carboxylase 2 inhibitory activity. Bioorg Med Chem Lett 16:6078-81 (2006)  
Target
Name:
Acetyl-CoA carboxylase 1
Synonyms:
ACAC ACACA_HUMAN ACC1 Acetyl-CoA carboxylase 1 | Acetyl-CoA carboxylase 1 (ACC1)
Type:
Protein
Mol. Mass.:
265543.22
Organism:
Homo sapiens (Human)
Description:
Q13085
Residue:
2346
  
Inhibitor
Name:
BDBM50189617
Synonyms:
(3R)-1'-(9-anthrylcarbonyl)-3-(morpholin-4-ylcarbonyl)-1,4'-bipiperidine CHEMBL208943 | {(3R)-1'-(anthracen-9-ylcarbonyl)[1,4'-bipiperidin]-3-yl}(morpholin-4-yl)methanone
Type:
Small organic molecule
Emp. Form.:
C30H35N3O3
Mol. Mass.:
485.6172
SMILES:
O=C([C@@H]1CCCN(C1)C1CCN(CC1)C(=O)c1c2ccccc2cc2ccccc12)N1CCOCC1
: