Target
Serine/threonine-protein kinase Chk1
Ligand
BDBM50195198
Substrate
Meas. Tech.
ChEMBL_424834 (CHEMBL908461)
EC50
3900±n/a nM
Citation
 Huang, SGarbaccio, RMFraley, MESteen, JKreatsoulas, CHartman, GStirdivant, SDrakas, BRickert, KWalsh, EHamilton, KBuser, CAHardwick, JMao, XAbrams, MBeck, STao, WLobell, RSepp-Lorenzino, LYan, YIkuta, MMurphy, JZSardana, VMunshi, SKuo, LReilly, MMahan, E Development of 6-substituted indolylquinolinones as potent Chek1 kinase inhibitors. Bioorg Med Chem Lett 16:5907-12 (2006)  
Target
Name:
Serine/threonine-protein kinase Chk1
Synonyms:
CHEK1 CHK1 checkpoint homolog Checkpoint kinase-1 (CHK1)
Type:
Enzyme Catalytic Domain
Mol. Mass.:
54443.02
Organism:
Homo sapiens (Human)
Description:
gi_166295192
Residue:
476
  
Inhibitor
Name:
BDBM50195198
Synonyms:
3-(5-((4-(aminomethyl)piperidin-1-yl)methyl)-1H-indol-2-yl)-2-oxo-1,2-dihydroquinoline-6-carboxamide | CHEMBL218489
Type:
Small organic molecule
Emp. Form.:
C25H27N5O2
Mol. Mass.:
429.5142
SMILES:
NCC1CCN(Cc2ccc3[nH]c(cc3c2)-c2cc3cc(ccc3[nH]c2=O)C(N)=O)CC1
: