Target
Tyrosine-protein kinase Lck
Ligand
BDBM50195345
Substrate
Meas. Tech.
ChEMBL_424915 (CHEMBL908547)
IC50
3±n/a nM
Citation
 Sabat, MVanRens, JCLaufersweiler, MJBrugel, TAMaier, JGolebiowski, ADe, BEaswaran, VHsieh, LCWalter, RLMekel, MJEvdokimov, AJanusz, MJ The development of 2-benzimidazole substituted pyrimidine based inhibitors of lymphocyte specific kinase (Lck). Bioorg Med Chem Lett 16:5973-7 (2006)  
Target
Name:
Tyrosine-protein kinase Lck
Synonyms:
2.7.10.2 LCK_HUMAN Leukocyte C-terminal Src kinase Lymphocyte-specific protein tyrosine kinase Protein YT16 Proto-oncogene tyrosine-protein kinase LCK T cell-specific protein-tyrosine kinase
Type:
Mol. Mass.:
57987.83
Organism:
Homo sapiens (Human)
Description:
P06239
Residue:
509
  
Inhibitor
Name:
BDBM50195345
Synonyms:
3-(2-(1H-benzo[d]imidazol-1-yl)-6-(4-methylpiperazin-1-yl)pyrimidin-4-ylamino)-4-methylphenol | CHEMBL220643
Type:
Small organic molecule
Emp. Form.:
C23H25N7O
Mol. Mass.:
415.4909
SMILES:
CN1CCN(CC1)c1cc(Nc2cc(O)ccc2C)nc(n1)-n1cnc2ccccc12
: