Target
Glyoxalase I
Ligand
BDBM50092826
Substrate
Meas. Tech.
ChEMBL_424952 (CHEMBL911358)
Ki
1200±n/a nM
Citation
 More, SSVince, R A metabolically stable tight-binding transition-state inhibitor of glyoxalase-I. Bioorg Med Chem Lett 16:6039-42 (2006)  
Target
Name:
Glyoxalase I
Synonyms:
GLO1 Lactoylglutathione lyase
Type:
PROTEIN
Mol. Mass.:
37210.98
Organism:
Saccharomyces cerevisiae
Description:
ChEMBL_571116
Residue:
326
  
Inhibitor
Name:
BDBM50092826
Synonyms:
(2S)-2-amino-5-{[(1R)-1-[({[(4-bromophenyl)(hydroxy)amino]carbonyl}thio)methyl]-2-(carboxyamino)-2-oxoethyl]amino}-5-oxopentanoic acid CHEMBL128872 | S-(N-4bromophenyl-N-hydroxycarbamoyl)glutathione
Type:
Small organic molecule
Emp. Form.:
C17H21BrN4O8S
Mol. Mass.:
521.34
SMILES:
N[C@@H](CCC(=O)N[C@@H](CSC(=O)N(O)c1ccc(Br)cc1)C(=O)NCC(O)=O)C(O)=O
: