Target
11-beta-hydroxysteroid dehydrogenase 1
Ligand
BDBM50195495
Substrate
Meas. Tech.
ChEMBL_425005 (CHEMBL912530)
Ki
160±n/a nM
Citation
 Richards, SSorensen, BJae, HSWinn, MChen, YWang, JFung, SMonzon, KFrevert, EUJacobson, PSham, HLink, JT Discovery of potent and selective inhibitors of 11beta-HSD1 for the treatment of metabolic syndrome. Bioorg Med Chem Lett 16:6241-5 (2006)  
Target
Name:
11-beta-hydroxysteroid dehydrogenase 1
Synonyms:
11-DH 11-beta-Hydroxysteroid Dehydrogenase 1 (11-beta-HSD1) Corticosteroid 11-beta-dehydrogenase isozyme 1 DHI1_RAT Hsd11b1
Type:
Enzyme
Mol. Mass.:
31889.48
Organism:
Rattus norvegicus (rat)
Description:
P16232
Residue:
288
  
Inhibitor
Name:
BDBM50195495
Synonyms:
3-((2R,6R)-1-(4-amino-3,5-dichlorobenzoyl)-2,6-dimethylpiperidin-4-yl)benzo[d]oxazol-2(3H)-one | CHEMBL435136
Type:
Small organic molecule
Emp. Form.:
C21H21Cl2N3O3
Mol. Mass.:
434.316
SMILES:
C[C@@H]1CC(C[C@@H](C)N1C(=O)c1cc(Cl)c(N)c(Cl)c1)n1c2ccccc2oc1=O
: