Target
11-beta-hydroxysteroid dehydrogenase type 2
Ligand
BDBM50195506
Substrate
Meas. Tech.
ChEMBL_425008 (CHEMBL911428)
IC50
>10000±n/a nM
Citation
 Richards, SSorensen, BJae, HSWinn, MChen, YWang, JFung, SMonzon, KFrevert, EUJacobson, PSham, HLink, JT Discovery of potent and selective inhibitors of 11beta-HSD1 for the treatment of metabolic syndrome. Bioorg Med Chem Lett 16:6241-5 (2006)  
Target
Name:
11-beta-hydroxysteroid dehydrogenase type 2
Synonyms:
11-beta-hydroxysteroid dehydrogenase 2 Hsd11b2 | Hsd11k
Type:
PROTEIN
Mol. Mass.:
43740.05
Organism:
Rattus norvegicus
Description:
ChEMBL_735659
Residue:
400
  
Inhibitor
Name:
BDBM50195506
Synonyms:
(4-amino-3,5-dichloro-phenyl)-(2-aza-tricyclo[3.3.1.1*3,7*]dec-2-yl)-methanone | CHEMBL222938
Type:
Small organic molecule
Emp. Form.:
C16H18Cl2N2O
Mol. Mass.:
325.233
SMILES:
Nc1c(Cl)cc(cc1Cl)C(=O)N1C2CC3CC(C2)CC1C3
: